Reaction Details
TargetGamma-aminobutyric acid receptor subunit alpha-1 [28-456]/beta-2 [26-512]/gamma-2 [40-467,D95C]
LigandBDBM26265
Substrate/CompetitorBDBM26263
Meas. Tech.Radioligand Binding Assay
Temperature298.15±n/a K
Ki 82.4±n/a nM
Commentsextracted
Citation Hanson, SMMorlock, EVSatyshur, KACzajkowski, C Structural Requirements for Eszopiclone and Zolpidem Binding to the gamma-Aminobutyric Acid Type-A (GABAA) Receptor Are Different. J Med Chem51:7243-52 (2008) 
 
Gamma-aminobutyric acid receptor subunit alpha-1 [28-456]/beta-2 [26-512]/gamma-2 [40-467,D95C]
Name:Gamma-aminobutyric acid receptor subunit alpha-1 [28-456]/beta-2 [26-512]/gamma-2 [40-467,D95C]
Synonyms:GABAA Receptor Mutant, alpha-1, beta-2, gamma-2 (D56C)
Type:Protein Complex
Mol. Mass.:n/a
Description:n/a
Components:This complex has 3 components.
Component 1
Name:Gamma-aminobutyric acid receptor subunit beta-2 [26-512]
Type:Ionic channel
Mol. Mass.:56212.32
Organism:Homo sapiens (Human)
Description:P47870[26-512]
Residue:487
Component 2
Name:Gamma-aminobutyric acid receptor subunit alpha-1 [28-456]
Synonyms:GABA(A) receptor subunit alpha-1 GABRA1 Gamma-aminobutyric acid receptor subunit alpha-1
Type:Ionic channel
Mol. Mass.:48807.81
Organism:Homo sapiens (Human)
Description:P14867[28-456]
Residue:429
Component 3
Name:Gamma-aminobutyric acid receptor subunit gamma-2 [40-467,D95C]
Synonyms:GABAA Receptor Subunit gamma-2 Mutant (D56C) GBRG2_HUMAN
Type:Ionic channel
Mol. Mass.:49851.83
Organism:Homo sapiens (Human)
Description:P18507[40-467,D95C]
Residue:428
BDBM26265
BDBM26263
NameBDBM26265
Synonyms:(5S)-6-(5-chloropyridin-2-yl)-7-oxo-5H,6H,7H-pyrrolo[3,4-b]pyrazin-5-yl 4-methylpiperazine-1-carboxylate Estorra Lunesta | cid_5735
TypeSmall organic molecule
Emp. Form.C17H17ClN6O3
Mol. Mass.388.808
SMILESCN1CCN(CC1)C(=O)Oc1n(-c2ccc(Cl)cn2)c(=O)c2ncc[nH]c12