Reaction Details
TargetAldo-keto reductase family 1 member C2
LigandBDBM26269
Substrate/CompetitorBDBM26271
Meas. Tech.Assay of Enzyme Activity
pH7.4±n/a
Temperature298.15±n/a K
Ki 70±2 nM
Citation Dhagat, UEndo, SSumii, RHara, AEl-Kabbani, O Selectivity determinants of inhibitor binding to human 20alpha-hydroxysteroid dehydrogenase: crystal structure of the enzyme in ternary complex with coenzyme and the potent inhibitor 3,5-dichlorosalicylic acid. J Med Chem51:4844-8 (2008) 
 
Aldo-keto reductase family 1 member C2
Name:Aldo-keto reductase family 1 member C2
Type:Enzyme
Mol. Mass.:36739.89
Organism:Homo sapiens (Human)
Description:n/a
Residue:323
BDBM26269
BDBM26271
NameBDBM26269
Synonyms:3,5-dichloro-2-hydroxybenzoic acid CHEMBL449129
TypeSmall organic molecule
Emp. Form.C7H4Cl2O3
Mol. Mass.207.011
SMILESOC(=O)c1cc(Cl)cc(Cl)c1O