Reaction Details
TargetTyrosine-protein kinase JAK3
LigandBDBM14949
Substrate/CompetitorBDBM17296
Meas. Tech.HTRF Kinase Inhibition Assay
IC50 20±n/a nM
Citation DiMauro, EFNewcomb, JNunes, JJBemis, JEBoucher, CChai, LChaffee, SCDeak, HLEpstein, LFFaust, TGallant, PGore, AGu, YHenkle, BHsieh, FHuang, XKim, JLLee, JHMartin, MWMcGowan, DCMetz, DMohn, DMorgenstern, KAOliveira-dos-Santos, APatel, VFPowers, DRose, PESchneider, STomlinson, SATudor, YYTurci, SMWelcher, AAZhao, HZhu, LZhu, X Structure-guided design of aminopyrimidine amides as potent, selective inhibitors of lymphocyte specific kinase: synthesis, structure-activity relationships, and inhibition of in vivo T cell activation. J Med Chem51:1681-94 (2008) 
 
Tyrosine-protein kinase JAK3
Name:Tyrosine-protein kinase JAK3
Type:Protein
Mol. Mass.:125111.08
Organism:Homo sapiens (Human)
Description:P52333
Residue:1124
BDBM14949
BDBM17296
NameBDBM14949
Synonyms:2-aminoquinazoline 5 CHEMBL385937 | JMC511681 Compound 34
TypeSmall organic molecule
Emp. Form.C23H17F3N4O
Mol. Mass.422.4025
SMILESCc1ccc(cc1-c1ccc2nc(N)ncc2c1)C(=O)Nc1cccc(c1)C(F)(F)F