Reaction Details
TargetCoagulation factor X
LigandBDBM387050
Substrate/Competitorn/a
Meas. Tech.In Vitro Assay
Ki<10±n/a nM
Citation Ding, ZLai, GChen, SYan, X Hydrazine compound as blood coagulation factor Xa inhibitor US Patent US9938272 Publication Date 4/10/2018
 
Coagulation factor X
Name:Coagulation factor X
Type:Enzyme
Mol. Mass.:54255.03
Organism:Rattus norvegicus (rat)
Description:n/a
Residue:482
BDBM387050
NameBDBM387050
Synonyms:1-(4-Methoxyphenyl)-6-(2′-oxo-[1,1′-bipiperidin]-4-yl)-3-(trifluoromethyl)-5,6-dihydro-1H-pyrazolo[3,4-c]pyridin-7(4H)-one | US9938272, Example 2
TypeSmall organic molecule
Emp. Form.C24H28F3N5O3
Mol. Mass.491.506
SMILESCOc1ccc(cc1)-n1nc(c2CCN(C3CCN(CC3)N3CCCCC3=O)C(=O)c12)C(F)(F)F