Reaction Details
TargetCoagulation factor V/Coagulation factor X/Serine/threonine-protein kinase BRSK2
LigandBDBM387056
Substrate/Competitorn/a
Meas. Tech.In Vitro Assay
Ki<10±n/a nM
Citation Ding, ZLai, GChen, SYan, X Hydrazine compound as blood coagulation factor Xa inhibitor US Patent US9938272 Publication Date 4/10/2018
 
Coagulation factor V/Coagulation factor X/Serine/threonine-protein kinase BRSK2
Name:Coagulation factor V/Coagulation factor X/Serine/threonine-protein kinase BRSK2
Synonyms:prothrombinase
Type:Protein
Mol. Mass.:n/a
Description:n/a
Components:This complex has 3 components.
Component 1
Name:Coagulation factor X
Type:Enzyme
Mol. Mass.:54726.60
Organism:Homo sapiens (Human)
Description:n/a
Residue:488
Component 2
Name:Coagulation factor V
Synonyms:Activated protein C cofactor Coagulation factor V light chain FA5_HUMAN | Proaccelerin, labile factor
Type:PROTEIN
Mol. Mass.:251677.76
Organism:Homo sapiens (Human)
Description:ChEMBL_476655
Residue:2224
Component 3
Name:Serine/threonine-protein kinase BRSK2
Synonyms:BR serine/threonine-protein kinase 2 BRSK2_HUMAN PEN11B STK29
Type:PROTEIN
Mol. Mass.:81657.07
Organism:Homo sapiens (Human)
Description:ChEMBL_586949
Residue:736
BDBM387056
NameBDBM387056
Synonyms:1-(4-Methoxyphenyl)-7-oxo-6-(2′-oxo-[1,1′-bipiperidin]-4-yl)-4,5,6,7-tetrahydro-1H-pyrazolo[3,4-c]pyridine-3-carbonitrile | US9938272, Example 5
TypeSmall organic molecule
Emp. Form.C24H28N6O3
Mol. Mass.448.5175
SMILESCOc1ccc(cc1)-n1nc(C#N)c2CCN(C3CCN(CC3)N3CCCCC3=O)C(=O)c12