Reaction Details
TargetCoagulation factor X
LigandBDBM387078
Substrate/Competitorn/a
Meas. Tech.In Vitro Assay
Ki<10±n/a nM
Citation Ding, ZLai, GChen, SYan, X Hydrazine compound as blood coagulation factor Xa inhibitor US Patent US9938272 Publication Date 4/10/2018
 
Coagulation factor X
Name:Coagulation factor X
Type:Enzyme
Mol. Mass.:54726.60
Organism:Homo sapiens (Human)
Description:n/a
Residue:488
BDBM387078
NameBDBM387078
Synonyms:4-(4-(1-(6-Chloronaphthalen-2-yl)-7-oxo-3-(trifluoromethyl)-4,5-dihydro-1H-pyrazolo[3,4-c]pyridin-6(7H)-yl)piperidin-1-yl)morpholin-3-one | US9938272, Example 24
TypeSmall organic molecule
Emp. Form.C26H25ClF3N5O3
Mol. Mass.547.957
SMILESFC(F)(F)c1nn(c2c1CCN(C1CCN(CC1)N1CCOCC1=O)C2=O)-c1ccc2cc(Cl)ccc2c1