Reaction Details
TargetCoagulation factor X
LigandBDBM387085
Substrate/Competitorn/a
Meas. Tech.In Vitro Assay
Ki<10±n/a nM
Citation Ding, ZLai, GChen, SYan, X Hydrazine compound as blood coagulation factor Xa inhibitor US Patent US9938272 Publication Date 4/10/2018
 
Coagulation factor X
Name:Coagulation factor X
Type:Enzyme
Mol. Mass.:54726.60
Organism:Homo sapiens (Human)
Description:n/a
Residue:488
BDBM387085
NameBDBM387085
Synonyms:3-(7-Oxo-6-(1-(3-oxomorpholino)piperidin-4-yl)-3-(trifluoromethyl)-4,5,6,7-tetrahydro-1H-pyrazolo[3,4-c]pyridin-1-yl)benzamide | US9938272, Example 31
TypeSmall organic molecule
Emp. Form.C23H25F3N6O4
Mol. Mass.506.4776
SMILESNC(=O)c1cccc(c1)-n1nc(c2CCN(C3CCN(CC3)N3CCOCC3=O)C(=O)c12)C(F)(F)F