Reaction Details
TargetHistamine H4 receptor
LigandBDBM26397
Substrate/CompetitorBDBM7966
Meas. Tech.Radioligand Binding Assay
pH7.4±n/a
Temperature298.15±n/a K
Ki 5.1±0.9 nM
Citation Cowart, MDAltenbach, RJLiu, HHsieh, GCDrizin, IMilicic, IMiller, TRWitte, DGWishart, NFix-Stenzel, SRMcPherson, MJAdair, RMWetter, JMBettencourt, BMMarsh, KCSullivan, JPHonore, PEsbenshade, TABrioni, JD Rotationally constrained 2,4-diamino-5,6-disubstituted pyrimidines: a new class of histamine H4 receptor antagonists with improved druglikeness and in vivo efficacy in pain and inflammation models. J Med Chem51:6547-57 (2008) 
 
Histamine H4 receptor
Name:Histamine H4 receptor
Type:G Protein-Coupled Receptor (GPCR)
Mol. Mass.:44045.07
Organism:Rattus norvegicus (rat)
Description:Cell pellets from SK-N-MC cells transfected with rat H4 receptor were used in binding assay.
Residue:391
BDBM26397
BDBM7966
NameBDBM26397
Synonyms:2,4-diamino-5,6-disubstituted pyrimidine, 11 | 6-[(3R)-3-(methylamino)pyrrolidin-1-yl]-3,5-diazatricyclo[9.4.0.0^{2,7}]pentadeca-1(15),2(7),3,5,11,13-hexaen-4-amine
TypeSmall organic molecule
Emp. Form.C18H23N5
Mol. Mass.309.4087
SMILESCN[C@@H]1CCN(C1)c1nc(N)nc-2c1CCCc1ccccc-21