Reaction Details
TargetHistamine H4 receptor
LigandBDBM26400
Substrate/CompetitorBDBM7966
Meas. Tech.Radioligand Binding Assay
pH7.4±n/a
Temperature298.15±n/a K
Ki 4.5±0.55 nM
Citation Cowart, MDAltenbach, RJLiu, HHsieh, GCDrizin, IMilicic, IMiller, TRWitte, DGWishart, NFix-Stenzel, SRMcPherson, MJAdair, RMWetter, JMBettencourt, BMMarsh, KCSullivan, JPHonore, PEsbenshade, TABrioni, JD Rotationally constrained 2,4-diamino-5,6-disubstituted pyrimidines: a new class of histamine H4 receptor antagonists with improved druglikeness and in vivo efficacy in pain and inflammation models. J Med Chem51:6547-57 (2008) 
 
Histamine H4 receptor
Name:Histamine H4 receptor
Type:G Protein-Coupled Receptor (GPCR)
Mol. Mass.:44045.07
Organism:Rattus norvegicus (rat)
Description:Cell pellets from SK-N-MC cells transfected with rat H4 receptor were used in binding assay.
Residue:391
BDBM26400
BDBM7966
NameBDBM26400
Synonyms:2,4-diamino-5,6-disubstituted pyrimidine, 14 | 9-phenyl-4-(piperazin-1-yl)-5H,6H,7H,8H,9H-cyclohepta[d]pyrimidin-2-amine
TypeSmall organic molecule
Emp. Form.C19H25N5
Mol. Mass.323.4353
SMILESNc1nc2C(CCCCc2c(n1)N1CCNCC1)c1ccccc1