Reaction Details
TargetPlatelet glycoprotein 4
LigandBDBM50370294
Substrate/Competitorn/a
Meas. Tech.Receptor Binding Assay with 125I-Ghrelin
pH7.3±n/a
IC50 2970±n/a nM
Commentsextracted
Citation Ong, HChemtob, SLubell, WSennlaub, FBoeglin, DProulx, CSajjadi, ZSabatino, D Azapeptides as CD36 binding compounds US Patent US9708370 Publication Date 7/18/2017
 
Platelet glycoprotein 4
Name:Platelet glycoprotein 4
Type:PROTEIN
Mol. Mass.:52740.95
Organism:Rattus norvegicus
Description:ChEMBL_858884
Residue:472
BDBM50370294
NameBDBM50370294
Synonyms:Examorelin US9708370, Hexareline
TypeSmall organic molecule
Emp. Form.C47H58N12O6
Mol. Mass.887.0402
SMILESC[C@H](NC(=O)[C@@H](Cc1c(C)[nH]c2ccccc12)NC(=O)[C@@H](N)Cc1cnc[nH]1)C(=O)N[C@@H](Cc1c[nH]c2ccccc12)C(=O)N[C@H](Cc1ccccc1)C(=O)N[C@@H](CCCCN)C(N)=O