Reaction Details
TargetPlatelet glycoprotein 4
LigandBDBM50395003
Substrate/Competitorn/a
Meas. Tech.Receptor Binding Assay with 125I-Ghrelin
pH7.3±n/a
IC50 9610±n/a nM
Commentsextracted
Citation Ong, HChemtob, SLubell, WSennlaub, FBoeglin, DProulx, CSajjadi, ZSabatino, D Azapeptides as CD36 binding compounds US Patent US9708370 Publication Date 7/18/2017
 
Platelet glycoprotein 4
Name:Platelet glycoprotein 4
Type:PROTEIN
Mol. Mass.:52740.95
Organism:Rattus norvegicus
Description:ChEMBL_858884
Residue:472
BDBM50395003
NameBDBM50395003
Synonyms:CHEMBL2163476 | US9708370, DBG-188p
TypeSmall organic molecule
Emp. Form.C44H53N13O6
Mol. Mass.859.9751
SMILESNCCCC[C@H](NC(=O)[C@@H](Cc1ccccc1)NC(=O)[C@H](Cc1c[nH]c2ccccc12)NC(=O)NNC(=O)[C@@H](Cc1c[nH]c2ccccc12)NC(=O)[C@@H](N)Cc1cnc[nH]1)C(N)=O