Reaction Details
Target72 kDa type IV collagenase
LigandBDBM26550
Substrate/CompetitorBDBM23499
Meas. Tech.MMP Inhibition Assay
pH7.4±n/a
Temperature295.15±n/a K
Ki 27±n/a nM
Citation Govinda Rao, BBandarage, UKWang, TCome, JHPerola, EWei, YTian, SKSaunders, JO Novel thiol-based TACE inhibitors: rational design, synthesis, and SAR of thiol-containing aryl sulfonamides. Bioorg Med Chem Lett17:2250-3 (2007) 
 
72 kDa type IV collagenase
Name:72 kDa type IV collagenase
Type:Enzyme
Mol. Mass.:73870.36
Organism:Homo sapiens (Human)
Description: P08253
Residue:660
BDBM26550
BDBM23499
NameBDBM26550
Synonyms:2-{[4-(but-2-yn-1-yloxy)benzene](methyl)sulfonamido}-N-hydroxyacetamide CHEMBL321556 | butynyloxy containing compound, 1
TypeSmall organic molecule
Emp. Form.C13H16N2O5S
Mol. Mass.312.342
SMILESCC#CCOc1ccc(cc1)S(=O)(=O)N(C)CC(=O)NO