Reaction Details
TargetMatrix metalloproteinase-9
LigandBDBM26543
Substrate/CompetitorBDBM23499
Meas. Tech.MMP Inhibition Assay
pH7.4±n/a
Temperature295.15±n/a K
Ki 200±n/a nM
Citation Bandarage, UKWang, TCome, JHPerola, EWei, YRao, BG Novel thiol-based TACE inhibitors. Part 2: Rational design, synthesis, and SAR of thiol-containing aryl sulfones. Bioorg Med Chem Lett18:44-8 (2008) 
 
Matrix metalloproteinase-9
Name:Matrix metalloproteinase-9
Type:Enzyme
Mol. Mass.:78452.28
Organism:Homo sapiens (Human)
Description:P14780
Residue:707
BDBM26543
BDBM23499
NameBDBM26543
Synonyms:(3R)-1-{[4-(but-2-yn-1-yloxy)benzene]sulfonyl}pyrrolidine-3-thiol thiol-arylsulfonamide, 4b
TypeSmall organic molecule
Emp. Form.C14H17NO3S2
Mol. Mass.311.42
SMILESCC#CCOc1ccc(cc1)S(=O)(=O)N1CC[C@@H](S)C1