Reaction Details
TargetPlasma kallikrein
LigandBDBM263236
Substrate/Competitorn/a
Meas. Tech.Inhibitory Activity Assay
IC50 6.46±0 nM
Citation Davie, RLEdwards, HJEvans, DMHodgson, STMiller, INovak, ARSmith, AJStocks, MJ Heterocyclic derivates US Patent US9533987 Publication Date 1/3/2017
 
Plasma kallikrein
Name:Plasma kallikrein
Type:Protein
Mol. Mass.:71391.16
Organism:Homo sapiens (Human)
Description:P03952
Residue:638
BDBM263236
NameBDBM263236
Synonyms:1-[4-(4-methyl-pyrazol-1-ylmethyl)-benzyl]-3-morpholin-4-yl-1h-pyrazole-4-carboxylic acid (1-amino-isoquinolin-6-ylmethyl)-amide | US9533987, example 21
TypeSmall organic molecule
Emp. Form.C30H32N8O2
Mol. Mass.536.6275
SMILESCc1cnn(Cc2ccc(Cn3cc(C(=O)NCc4ccc5c(N)nccc5c4)c(n3)N3CCOCC3)cc2)c1