Reaction Details
TargetPlasma kallikrein
LigandBDBM263286
Substrate/Competitorn/a
Meas. Tech.Inhibitory Activity Assay
IC50 10.4±0 nM
Citation Davie, RLEdwards, HJEvans, DMHodgson, STMiller, INovak, ARSmith, AJStocks, MJ Heterocyclic derivates US Patent US9533987 Publication Date 1/3/2017
 
Plasma kallikrein
Name:Plasma kallikrein
Type:Protein
Mol. Mass.:71391.16
Organism:Homo sapiens (Human)
Description:P03952
Residue:638
BDBM263286
NameBDBM263286
Synonyms:1-(2-pyrrolidin-1-yl-pyrimidin-5-ylmethyl)-3-trifluoromethyl-1h-pyrazole-4-carboxylic acid (1-amino-isoquinolin-6-ylmethyl)-amide | US9533987, example 64
TypeSmall organic molecule
Emp. Form.C24H23F3N8O
Mol. Mass.496.4876
SMILESNc1nccc2cc(CNC(=O)c3cn(Cc4cnc(nc4)N4CCCC4)nc3C(F)(F)F)ccc12