Reaction Details
TargetPlasma kallikrein
LigandBDBM263298
Substrate/Competitorn/a
Meas. Tech.Inhibitory Activity Assay
IC50 0.92±0 nM
Citation Davie, RLEdwards, HJEvans, DMHodgson, STMiller, INovak, ARSmith, AJStocks, MJ Heterocyclic derivates US Patent US9533987 Publication Date 1/3/2017
 
Plasma kallikrein
Name:Plasma kallikrein
Type:Protein
Mol. Mass.:71391.16
Organism:Homo sapiens (Human)
Description:P03952
Residue:638
BDBM263298
NameBDBM263298
Synonyms:1-(4-pyrazol-1-ylmethyl-benzyl)-3-trifluoromethyl-1h-pyrazole-4-carboxylic acid(1-amino-isoquinolin-6-ylmethyl)-amide | US9533987, example 76
TypeSmall organic molecule
Emp. Form.C26H22F3N7O
Mol. Mass.505.4944
SMILESNc1nccc2cc(CNC(=O)c3cn(Cc4ccc(Cn5cccn5)cc4)nc3C(F)(F)F)ccc12