Reaction Details
TargetFatty-acid amide hydrolase 1
LigandBDBM23120
Substrate/CompetitorBDBM23028
Meas. Tech.FAAH Inhibition Assay (30 min Preincubation)
pH7.4±n/a
Temperature303.15±n/a K
IC50 252±n/a nM
Citation Ahn, KJohnson, DSFitzgerald, LRLiimatta, MArendse, AStevenson, TLund, ETNugent, RANomanbhoy, TKAlexander, JPCravatt, BF Novel mechanistic class of fatty acid amide hydrolase inhibitors with remarkable selectivity. Biochemistry46:13019-30 (2007) 
 
Fatty-acid amide hydrolase 1
Name:Fatty-acid amide hydrolase 1
Type:Protein
Mol. Mass.:63071.19
Organism:Homo sapiens (Human)
Description:O00519
Residue:579
BDBM23120
BDBM23028
NameBDBM23120
Synonyms:7-phenyl-1-[5-(pyridin-2-yl)-1,3-oxazol-2-yl]heptan-1-one OL-135
TypeSmall organic molecule
Emp. Form.C21H22N2O2
Mol. Mass.334.4116
SMILESO=C(CCCCCCc1ccccc1)c1ncc(o1)-c1ccccn1