Reaction Details
TargetInterleukin-6
LigandBDBM65497
Substrate/Competitorn/a
Meas. Tech.cytomteric bead array (CBA) assay
Temperature310.15±n/a K
IC50 3.80±n/a nM
Commentsextracted
Citation Gandhi, ADimartino, JChopra, R Methods for the treatment of locally advanced breast cancer US Patent US9694015 Publication Date 7/4/2017
 
Interleukin-6
Name:Interleukin-6
Type:n/a
Mol. Mass.:23717.96
Organism:Homo sapiens (Human)
Description:P05231
Residue:212
BDBM65497
NameBDBM65497
Synonyms:CC-220 (Compound 6) | US9694015, 6.4S
TypeSmall organic molecule
Emp. Form.C25H27N3O5
Mol. Mass.449.499
SMILESO=C1N(Cc2c1cccc2OCc1ccc(CN2CCOCC2)cc1)[C@H]1CCC(=O)NC1=O