Reaction Details
TargetC-C motif chemokine 3
LigandBDBM50070114
Substrate/Competitorn/a
Meas. Tech.cytomteric bead array (CBA) assay
Temperature310.15±n/a K
IC50>10000±n/a nM
Commentsextracted
Citation Gandhi, ADimartino, JChopra, R Methods for the treatment of locally advanced breast cancer US Patent US9694015 Publication Date 7/4/2017
 
C-C motif chemokine 3
Name:C-C motif chemokine 3
Type:Protein
Mol. Mass.:10083.38
Organism:Homo sapiens (Human)
Description:P10147
Residue:92
BDBM50070114
NameBDBM50070114
Synonyms:(+/-)-thalidomide 2-(2,6-dioxopiperidin-3-yl)isoindoline-1,3-dione K-17 Thalomid [(R,S)-2-(2,6-dioxo-3-piperidinyl)-1H-isoindole-1,3(2H)-dione
TypeSmall organic molecule
Emp. Form.C13H10N2O4
Mol. Mass.258.2295
SMILESO=C1N(C2CCC(=O)NC2=O)C(=O)c2ccccc12