Reaction Details
TargetC-C motif chemokine 4
LigandBDBM65454
Substrate/Competitorn/a
Meas. Tech.cytomteric bead array (CBA) assay
Temperature310.15±n/a K
IC50>10000±n/a nM
Commentsextracted
Citation Gandhi, ADimartino, JChopra, R Methods for the treatment of locally advanced breast cancer US Patent US9694015 Publication Date 7/4/2017
 
C-C motif chemokine 4
Name:C-C motif chemokine 4
Type:Protein
Mol. Mass.:10210.74
Organism:Homo sapiens (Human)
Description:P13236
Residue:92
BDBM65454
NameBDBM65454
Synonyms:191732-72-6 Lenalidomide Revlimid US9694015, 6.1
TypeSmall organic molecule
Emp. Form.C13H13N3O3
Mol. Mass.259.2606
SMILESNc1cccc2C(=O)N(Cc12)C1CCC(=O)NC1=O