Reaction Details
TargetSodium channel protein type 9 subunit alpha
LigandBDBM70845
Substrate/Competitorn/a
Meas. Tech.Electrophysiological Assay (EP) (In vitro Assay)
pH7.2±n/a
IC50 0.900±n/a nM
Commentsextracted
Citation Andrez, JBichler, PRChen, CChowdhury, SDecker, SMDehnhardt, CMFocken, TGrimwood, MEHemeon, IWJia, QLi, JLiu, ZOrtwine, DFSafina, BSutherlin, DSheng, TSun, SWhite, ADWilson, MSZenova, AYZhu, J Substituted benzamides and methods of use thereof US Patent US9546164 Publication Date 1/17/2017
 
Sodium channel protein type 9 subunit alpha
Name:Sodium channel protein type 9 subunit alpha
Type:Protein
Mol. Mass.:226375.97
Organism:Homo sapiens (Human)
Description:Q15858
Residue:1988
BDBM70845
NameBDBM70845
Synonyms:US9546164, 6 | US9694002, 27
TypeSmall organic molecule
Emp. Form.C25H28ClFN2O4S
Mol. Mass.507.017
SMILESFc1cc(O[C@@H]2CCCN(Cc3cccc(Cl)c3)C2)c(cc1C(=O)NS(=O)(=O)C1CC1)C1CC1