Reaction Details
TargetSodium channel protein type 5 subunit alpha
LigandBDBM70878
Substrate/Competitorn/a
Meas. Tech.Radioligand Binding Assay (EP) (In vitro Assay)
pH7.4±n/a
Temperature298.15±n/a K
IC50<1.60±n/a nM
Commentsextracted
Citation Andrez, JBichler, PRChen, CChowdhury, SDecker, SMDehnhardt, CMFocken, TGrimwood, MEHemeon, IWJia, QLi, JLiu, ZOrtwine, DFSafina, BSutherlin, DSheng, TSun, SWhite, ADWilson, MSZenova, AYZhu, J Substituted benzamides and methods of use thereof US Patent US9546164 Publication Date 1/17/2017
 
Sodium channel protein type 5 subunit alpha
Name:Sodium channel protein type 5 subunit alpha
Type:Enzyme
Mol. Mass.:226908.60
Organism:Homo sapiens (Human)
Description:Q14524
Residue:2016
BDBM70878
NameBDBM70878
Synonyms:US9546164, 52 | US9694002, 52
TypeSmall organic molecule
Emp. Form.C24H27ClF2N2O4S
Mol. Mass.512.997
SMILESC[C@@H]1CC[C@H](CN1Cc1ccc(F)cc1Cl)Oc1cc(F)c(cc1C1CC1)C(=O)NS(C)(=O)=O