Reaction Details
TargetSodium channel protein type 5 subunit alpha
LigandBDBM71349
Substrate/Competitorn/a
Meas. Tech.Radioligand Binding Assay (EP) (In vitro Assay)
pH7.4±n/a
Temperature298.15±n/a K
IC50 2.40±n/a nM
Commentsextracted
Citation Andrez, JBichler, PRChen, CChowdhury, SDecker, SMDehnhardt, CMFocken, TGrimwood, MEHemeon, IWJia, QLi, JLiu, ZOrtwine, DFSafina, BSutherlin, DSheng, TSun, SWhite, ADWilson, MSZenova, AYZhu, J Substituted benzamides and methods of use thereof US Patent US9546164 Publication Date 1/17/2017
 
Sodium channel protein type 5 subunit alpha
Name:Sodium channel protein type 5 subunit alpha
Type:Enzyme
Mol. Mass.:226908.60
Organism:Homo sapiens (Human)
Description:Q14524
Residue:2016
BDBM71349
NameBDBM71349
Synonyms:US9546164, 420 | US9694002, 420
TypeSmall organic molecule
Emp. Form.C29H29Cl2FN2O4S
Mol. Mass.591.521
SMILESCC1(COc2cc(F)c(cc2C2CC2)C(=O)NS(C)(=O)=O)CN(C1)C(c1ccccc1)c1cc(Cl)cc(Cl)c1