Reaction Details
TargetSodium channel protein type 9 subunit alpha
LigandBDBM263840
Substrate/Competitorn/a
Meas. Tech.Electrophysiological Assay (EP) (In vitro Assay)
pH7.2±n/a
IC50 1.80±n/a nM
Commentsextracted
Citation Andrez, JBichler, PRChen, CChowdhury, SDecker, SMDehnhardt, CMFocken, TGrimwood, MEHemeon, IWJia, QLi, JLiu, ZOrtwine, DFSafina, BSutherlin, DSheng, TSun, SWhite, ADWilson, MSZenova, AYZhu, J Substituted benzamides and methods of use thereof US Patent US9546164 Publication Date 1/17/2017
 
Sodium channel protein type 9 subunit alpha
Name:Sodium channel protein type 9 subunit alpha
Type:Protein
Mol. Mass.:226375.97
Organism:Homo sapiens (Human)
Description:Q15858
Residue:1988
BDBM263840
NameBDBM263840
Synonyms:5-cyclopropyl-N-(cyclopropylsulfonyl)-4-(((1R,3r,5S)-3-(3,5-dichlorophenoxy)-8-azabicyclo[3.2.1]octan-8-yl)methyl)-2-fluorobenzamide hydrochloride | US9546164, 475
TypeSmall organic molecule
Emp. Form.C27H29Cl2FN2O4S
Mol. Mass.567.5
SMILESFc1cc(CN2C3CCC2CC(C3)Oc2cc(Cl)cc(Cl)c2)c(cc1C(=O)NS(=O)(=O)C1CC1)C1CC1