Reaction Details
TargetTyrosine-protein kinase Fgr
LigandBDBM50184769
Substrate/Competitorn/a
Meas. Tech.Kinase Screening Assay
IC50 550±n/a nM
Citation Unciti-Broceta, AFraser, CO. Carragher, N Compounds US Patent US10294227 Publication Date 5/21/2019
 
Tyrosine-protein kinase Fgr
Name:Tyrosine-protein kinase Fgr
Type:protein
Mol. Mass.:59469.88
Organism:Homo sapiens (Human)
Description:P09769
Residue:529
BDBM50184769
NameBDBM50184769
Synonyms:CHEMBL3823212 | US10294227, Code 109
TypeSmall organic molecule
Emp. Form.C21H29N7
Mol. Mass.379.5019
SMILESCN(C)C1CCN(CCn2nc(-c3ccc(C)cc3)c3c(N)ncnc23)CC1