Reaction Details
TargetTyrosine-protein kinase Fgr
LigandBDBM50184781
Substrate/Competitorn/a
Meas. Tech.Kinase Screening Assay
IC50<10.00±n/a nM
Citation Unciti-Broceta, AFraser, CO. Carragher, N Compounds US Patent US10294227 Publication Date 5/21/2019
 
Tyrosine-protein kinase Fgr
Name:Tyrosine-protein kinase Fgr
Type:protein
Mol. Mass.:59469.88
Organism:Homo sapiens (Human)
Description:P09769
Residue:529
BDBM50184781
NameBDBM50184781
Synonyms:CHEMBL3823543 | US10294227, Code 533
TypeSmall organic molecule
Emp. Form.C28H36N8O
Mol. Mass.500.6384
SMILESCOc1cc(ccc1NCc1ccccc1)-c1nn(CCN2CCC(CC2)N(C)C)c2ncnc(N)c12