Reaction Details
TargetTyrosine-protein kinase Fgr
LigandBDBM50184784
Substrate/Competitorn/a
Meas. Tech.Kinase Screening Assay
IC50>1000±n/a nM
Citation Unciti-Broceta, AFraser, CO. Carragher, N Compounds US Patent US10294227 Publication Date 5/21/2019
 
Tyrosine-protein kinase Fgr
Name:Tyrosine-protein kinase Fgr
Type:protein
Mol. Mass.:59469.88
Organism:Homo sapiens (Human)
Description:P09769
Residue:529
BDBM50184784
NameBDBM50184784
Synonyms:CHEMBL3824021 | US10294227, Code 556
TypeSmall organic molecule
Emp. Form.C22H29N7O2
Mol. Mass.423.5114
SMILESCN(C)C1CCN(CCn2nc(-c3ccc(CC(O)=O)cc3)c3c(N)ncnc23)CC1