Reaction Details
TargetTyrosine-protein kinase FRK
LigandBDBM387839
Substrate/Competitorn/a
Meas. Tech.Kinase Screening Assay
IC50>1000±n/a nM
Citation Unciti-Broceta, AFraser, CO. Carragher, N Compounds US Patent US10294227 Publication Date 5/21/2019
 
Tyrosine-protein kinase FRK
Name:Tyrosine-protein kinase FRK
Type:Tyrosine-protein kinase
Mol. Mass.:58254.41
Organism:Homo sapiens (Human)
Description:P42685
Residue:505
BDBM387839
NameBDBM387839
Synonyms:US10294227, Code 103
TypeSmall organic molecule
Emp. Form.C19H25N7
Mol. Mass.351.4487
SMILESCN1CCN(CCn2nc(-c3ccc(C)cc3)c3c(N)ncnc23)CC1