Reaction Details
TargetProto-oncogene tyrosine-protein kinase Src
LigandBDBM50184772
Substrate/Competitorn/a
Meas. Tech.Kinase Screening Assay
IC50>1000±n/a nM
Citation Unciti-Broceta, AFraser, CO. Carragher, N Compounds US Patent US10294227 Publication Date 5/21/2019
 
Proto-oncogene tyrosine-protein kinase Src
Name:Proto-oncogene tyrosine-protein kinase Src
Type:Protein
Mol. Mass.:59838.60
Organism:Homo sapiens (Human)
Description:P12931
Residue:536
BDBM50184772
NameBDBM50184772
Synonyms:CHEMBL3822591 | US10294227, Code 113
TypeSmall organic molecule
Emp. Form.C23H33N7
Mol. Mass.407.555
SMILESCN(C)CCC1CCN(CCn2nc(-c3ccc(C)cc3)c3c(N)ncnc23)CC1