Reaction Details
TargetVitamin D3 receptor
LigandBDBM50207116
Substrate/Competitorn/a
Meas. Tech.Dopamine D3 Receptor Binding Test
Ki 0.029±n/a nM
Citation Li, JChen, XMa, ZZhang, LCui, N Benzoisothiazole compounds and methods of treating schizophrenia US Patent US9550741 Publication Date 1/24/2017
 
Vitamin D3 receptor
Name:Vitamin D3 receptor
Type:Protein
Mol. Mass.:48288.72
Organism:Homo sapiens (Human)
Description:P11473
Residue:427
BDBM50207116
NameBDBM50207116
Synonyms:CHEMBL3905247 | US9550741, I-4
TypeSmall organic molecule
Emp. Form.C28H33N5OS
Mol. Mass.487.66
SMILESO=C(N[C@H]1CC[C@H](CCN2CCN(CC2)c2nsc3ccccc23)CC1)c1cc2ccccc2[nH]1