Reaction Details
TargetVitamin D3 receptor
LigandBDBM263383
Substrate/Competitorn/a
Meas. Tech.Dopamine D3 Receptor Binding Test
Ki 0.100±n/a nM
Citation Li, JChen, XMa, ZZhang, LCui, N Benzoisothiazole compounds and methods of treating schizophrenia US Patent US9550741 Publication Date 1/24/2017
 
Vitamin D3 receptor
Name:Vitamin D3 receptor
Type:Protein
Mol. Mass.:48288.72
Organism:Homo sapiens (Human)
Description:P11473
Residue:427
BDBM263383
NameBDBM263383
Synonyms:US9550741, I-17
TypeSmall organic molecule
Emp. Form.C25H32N4OS2
Mol. Mass.468.678
SMILESO=C(Cc1cccs1)N[C@H]1CC[C@H](CCN2CCN(CC2)c2nsc3ccccc23)CC1