Reaction Details
TargetVitamin D3 receptor
LigandBDBM263421
Substrate/Competitorn/a
Meas. Tech.Dopamine D3 Receptor Binding Test
Ki 0.093±n/a nM
Citation Li, JChen, XMa, ZZhang, LCui, N Benzoisothiazole compounds and methods of treating schizophrenia US Patent US9550741 Publication Date 1/24/2017
 
Vitamin D3 receptor
Name:Vitamin D3 receptor
Type:Protein
Mol. Mass.:48288.72
Organism:Homo sapiens (Human)
Description:P11473
Residue:427
BDBM263421
NameBDBM263421
Synonyms:US9550741, III-3
TypeSmall organic molecule
Emp. Form.C24H36N4O2S
Mol. Mass.444.633
SMILESCC(C)COC(=O)N[C@H]1CC[C@H](CCN2CCN(CC2)c2nsc3ccccc23)CC1