Reaction Details
Target5-hydroxytryptamine receptor 1A
LigandBDBM263372
Substrate/Competitorn/a
Meas. Tech.5-HT1A Receptor Binding Test
pH7.4±n/a
Ki 3.54±n/a nM
Commentsextracted
Citation Li, JChen, XMa, ZZhang, LCui, N Benzoisothiazole compounds and methods of treating schizophrenia US Patent US9550741 Publication Date 1/24/2017
 
5-hydroxytryptamine receptor 1A
Name:5-hydroxytryptamine receptor 1A
Type:n/a
Mol. Mass.:46122.49
Organism:Homo sapiens (Human)
Description:n/a
Residue:422
BDBM263372
NameBDBM263372
Synonyms:US9550741, I-6
TypeSmall organic molecule
Emp. Form.C28H32N4OS2
Mol. Mass.504.71
SMILESO=C(N[C@H]1CC[C@H](CCN2CCN(CC2)c2nsc3ccccc23)CC1)c1cc2ccccc2s1