Reaction Details
TargetD(2) dopamine receptor
LigandBDBM50207162
Substrate/Competitorn/a
Meas. Tech.Receptor Binding Test
pH7.5±n/a
Ki 1.06±n/a nM
Commentsextracted
Citation Li, JChen, XMa, ZZhang, LCui, N Benzoisothiazole compounds and methods of treating schizophrenia US Patent US9550741 Publication Date 1/24/2017
 
D(2) dopamine receptor
Name:D(2) dopamine receptor
Type:Cell-surface receptors
Mol. Mass.:50647.10
Organism:Homo sapiens (Human)
Description:P14416
Residue:443
BDBM50207162
NameBDBM50207162
Synonyms:CHEMBL3918755 | US9550741, IV-1
TypeSmall organic molecule
Emp. Form.C26H33N5OS
Mol. Mass.463.638
SMILESO=C(N[C@H]1CC[C@H](CCN2CCN(CC2)c2nsc3ccccc23)CC1)Nc1ccccc1