Reaction Details
Target5-hydroxytryptamine receptor 1A
LigandBDBM50207162
Substrate/Competitorn/a
Meas. Tech.5-HT1A Receptor Binding Test
pH7.4±n/a
Ki 3.65±n/a nM
Commentsextracted
Citation Li, JChen, XMa, ZZhang, LCui, N Benzoisothiazole compounds and methods of treating schizophrenia US Patent US9550741 Publication Date 1/24/2017
 
5-hydroxytryptamine receptor 1A
Name:5-hydroxytryptamine receptor 1A
Type:n/a
Mol. Mass.:46122.49
Organism:Homo sapiens (Human)
Description:n/a
Residue:422
BDBM50207162
NameBDBM50207162
Synonyms:CHEMBL3918755 | US9550741, IV-1
TypeSmall organic molecule
Emp. Form.C26H33N5OS
Mol. Mass.463.638
SMILESO=C(N[C@H]1CC[C@H](CCN2CCN(CC2)c2nsc3ccccc23)CC1)Nc1ccccc1