Reaction Details
TargetVitamin D3 receptor
LigandBDBM50207113
Substrate/Competitorn/a
Meas. Tech.Dopamine D3 Receptor Binding Test
Ki 0.068±n/a nM
Citation Li, JChen, XMa, ZZhang, LCui, N Benzoisothiazole compounds and methods of treating schizophrenia US Patent US9550741 Publication Date 1/24/2017
 
Vitamin D3 receptor
Name:Vitamin D3 receptor
Type:Protein
Mol. Mass.:48288.72
Organism:Homo sapiens (Human)
Description:P11473
Residue:427
BDBM50207113
NameBDBM50207113
Synonyms:CHEMBL3896937 | US9550741, IV-3
TypeSmall organic molecule
Emp. Form.C25H32N6OS
Mol. Mass.464.626
SMILESO=C(N[C@H]1CC[C@H](CCN2CCN(CC2)c2nsc3ccccc23)CC1)Nc1cccnc1