Reaction Details
TargetNociceptin receptor
LigandBDBM26906
Substrate/CompetitorBDBM21842
Meas. Tech.Radioligand Binding Assay
pH7.4±n/a
Temperature295.15±n/a K
Ki 2.1±n/a nM
Citation Caldwell, JPMatasi, JJFernandez, XMcLeod, RLZhang, HFawzi, ATulshian, DB Synthesis and structure-activity relationships of N-substituted spiropiperidines as nociceptin receptor ligands: part 2. Bioorg Med Chem Lett19:1164-7 (2009) 
 
Nociceptin receptor
Name:Nociceptin receptor
Type:G Protein-Coupled Receptor (GPCR)
Mol. Mass.:40702.87
Organism:Homo sapiens (Human)
Description:P41146
Residue:370
BDBM26906
BDBM21842
NameBDBM26906
Synonyms:8-[bis(2-chlorophenyl)methyl]-3-[2-(ethylamino)ethyl]-1-phenyl-1,3,8-triazaspiro[4.5]decan-4-one | spiropiperidine analogue, 27
TypeSmall organic molecule
Emp. Form.C30H34Cl2N4O
Mol. Mass.537.523
SMILESCCNCCN1CN(c2ccccc2)C2(CCN(CC2)C(c2ccccc2Cl)c2ccccc2Cl)C1=O