Reaction Details
TargetNociceptin receptor
LigandBDBM26907
Substrate/CompetitorBDBM21842
Meas. Tech.Radioligand Binding Assay
pH7.4±n/a
Temperature295.15±n/a K
Ki 2.55±n/a nM
Citation Caldwell, JPMatasi, JJFernandez, XMcLeod, RLZhang, HFawzi, ATulshian, DB Synthesis and structure-activity relationships of N-substituted spiropiperidines as nociceptin receptor ligands: part 2. Bioorg Med Chem Lett19:1164-7 (2009) 
 
Nociceptin receptor
Name:Nociceptin receptor
Type:G Protein-Coupled Receptor (GPCR)
Mol. Mass.:40702.87
Organism:Homo sapiens (Human)
Description:P41146
Residue:370
BDBM26907
BDBM21842
NameBDBM26907
Synonyms:8-[bis(2-chlorophenyl)methyl]-1-phenyl-3-[2-(propan-2-ylamino)ethyl]-1,3,8-triazaspiro[4.5]decan-4-one | spiropiperidine analogue, 28
TypeSmall organic molecule
Emp. Form.C31H36Cl2N4O
Mol. Mass.551.55
SMILESCC(C)NCCN1CN(c2ccccc2)C2(CCN(CC2)C(c2ccccc2Cl)c2ccccc2Cl)C1=O