Reaction Details
TargetNociceptin receptor
LigandBDBM26916
Substrate/CompetitorBDBM21842
Meas. Tech.Radioligand Binding Assay
pH7.4±n/a
Temperature295.15±n/a K
Ki 2.25±n/a nM
Citation Caldwell, JPMatasi, JJFernandez, XMcLeod, RLZhang, HFawzi, ATulshian, DB Synthesis and structure-activity relationships of N-substituted spiropiperidines as nociceptin receptor ligands: part 2. Bioorg Med Chem Lett19:1164-7 (2009) 
 
Nociceptin receptor
Name:Nociceptin receptor
Type:G Protein-Coupled Receptor (GPCR)
Mol. Mass.:40702.87
Organism:Homo sapiens (Human)
Description:P41146
Residue:370
BDBM26916
BDBM21842
NameBDBM26916
Synonyms:8-[bis(2-chlorophenyl)methyl]-1-phenyl-3-[2-(pyrrolidin-1-yl)ethyl]-1,3,8-triazaspiro[4.5]decan-4-one | spiropiperidine analogue, 37
TypeSmall organic molecule
Emp. Form.C32H36Cl2N4O
Mol. Mass.563.56
SMILESClc1ccccc1C(N1CCC2(CC1)N(CN(CCN1CCCC1)C2=O)c1ccccc1)c1ccccc1Cl