Reaction Details
TargetNociceptin receptor
LigandBDBM26928
Substrate/CompetitorBDBM21842
Meas. Tech.Radioligand Binding Assay
Ki 1.0±n/a nM
Citation Caldwell, JPMatasi, JJFernandez, XMcLeod, RLZhang, HFawzi, ATulshian, DB Synthesis and structure-activity relationships of N-substituted spiropiperidines as nociceptin receptor ligands: part 2. Bioorg Med Chem Lett19:1164-7 (2009) 
 
Nociceptin receptor
Name:Nociceptin receptor
Type:G Protein-Coupled Receptor (GPCR)
Mol. Mass.:40702.87
Organism:Homo sapiens (Human)
Description:P41146
Residue:370
BDBM26928
BDBM21842
NameBDBM26928
Synonyms:8-[(2,6-dichlorophenyl)methyl]-3-[2-(diethylamino)ethyl]-1-phenyl-1,3,8-triazaspiro[4.5]decan-4-one | spiropiperidine analogue, 49
TypeSmall organic molecule
Emp. Form.C26H34Cl2N4O
Mol. Mass.489.48
SMILESCCN(CC)CCN1CN(c2ccccc2)C2(CCN(Cc3c(Cl)cccc3Cl)CC2)C1=O