Reaction Details
TargetNociceptin receptor
LigandBDBM26938
Substrate/CompetitorBDBM21842
Meas. Tech.Radioligand Binding Assay
Ki 1.0±n/a nM
Citation Caldwell, JPMatasi, JJFernandez, XMcLeod, RLZhang, HFawzi, ATulshian, DB Synthesis and structure-activity relationships of N-substituted spiropiperidines as nociceptin receptor ligands: part 2. Bioorg Med Chem Lett19:1164-7 (2009) 
 
Nociceptin receptor
Name:Nociceptin receptor
Type:G Protein-Coupled Receptor (GPCR)
Mol. Mass.:40702.87
Organism:Homo sapiens (Human)
Description:P41146
Residue:370
BDBM26938
BDBM21842
NameBDBM26938
Synonyms:8-(4,4-dimethyl-1,2,3,4-tetrahydronaphthalen-1-yl)-1-phenyl-3-[2-(propylamino)ethyl]-1,3,8-triazaspiro[4.5]decan-4-one | spiropiperidine analogue, 59
TypeSmall organic molecule
Emp. Form.C30H42N4O
Mol. Mass.474.6807
SMILESCCCNCCN1CN(c2ccccc2)C2(CCN(CC2)C2CCC(C)(C)c3ccccc23)C1=O