Reaction Details
TargetNociceptin receptor
LigandBDBM26939
Substrate/CompetitorBDBM21842
Meas. Tech.Radioligand Binding Assay
Ki 0.9±n/a nM
Citation Caldwell, JPMatasi, JJFernandez, XMcLeod, RLZhang, HFawzi, ATulshian, DB Synthesis and structure-activity relationships of N-substituted spiropiperidines as nociceptin receptor ligands: part 2. Bioorg Med Chem Lett19:1164-7 (2009) 
 
Nociceptin receptor
Name:Nociceptin receptor
Type:G Protein-Coupled Receptor (GPCR)
Mol. Mass.:40702.87
Organism:Homo sapiens (Human)
Description:P41146
Residue:370
BDBM26939
BDBM21842
NameBDBM26939
Synonyms:8-(4,4-dimethyl-1,2,3,4-tetrahydronaphthalen-1-yl)-1-phenyl-3-[2-(prop-2-en-1-ylamino)ethyl]-1,3,8-triazaspiro[4.5]decan-4-one | spiropiperidine analogue, 60
TypeSmall organic molecule
Emp. Form.C30H40N4O
Mol. Mass.472.6648
SMILESCC1(C)CCC(N2CCC3(CC2)N(CN(CCNCC=C)C3=O)c2ccccc2)c2ccccc12