Reaction Details
TargetNociceptin receptor
LigandBDBM26947
Substrate/CompetitorBDBM21842
Meas. Tech.Radioligand Binding Assay
Ki 1.3±n/a nM
Citation Caldwell, JPMatasi, JJFernandez, XMcLeod, RLZhang, HFawzi, ATulshian, DB Synthesis and structure-activity relationships of N-substituted spiropiperidines as nociceptin receptor ligands: part 2. Bioorg Med Chem Lett19:1164-7 (2009) 
 
Nociceptin receptor
Name:Nociceptin receptor
Type:G Protein-Coupled Receptor (GPCR)
Mol. Mass.:40702.87
Organism:Homo sapiens (Human)
Description:P41146
Residue:370
BDBM26947
BDBM21842
NameBDBM26947
Synonyms:8-(4,4-dimethyl-1,2,3,4-tetrahydronaphthalen-1-yl)-1-phenyl-1,3,8-triazaspiro[4.5]decan-4-one spiropiperidine analogue, 3
TypeSmall organic molecule
Emp. Form.C25H31N3O
Mol. Mass.389.5331
SMILESCC1(C)CCC(N2CCC3(CC2)N(CNC3=O)c2ccccc2)c2ccccc12