Reaction Details
TargetKappa-type opioid receptor
LigandBDBM26926
Substrate/CompetitorBDBM21865
Meas. Tech.Radioligand Binding Assay
Ki 8±n/a nM
Citation Caldwell, JPMatasi, JJFernandez, XMcLeod, RLZhang, HFawzi, ATulshian, DB Synthesis and structure-activity relationships of N-substituted spiropiperidines as nociceptin receptor ligands: part 2. Bioorg Med Chem Lett19:1164-7 (2009) 
 
Kappa-type opioid receptor
Name:Kappa-type opioid receptor
Type:G Protein-Coupled Receptor (GPCR)
Mol. Mass.:42648.76
Organism:Homo sapiens (Human)
Description:P41145
Residue:380
BDBM26926
BDBM21865
NameBDBM26926
Synonyms:8-[(2,6-dichlorophenyl)methyl]-3-{2-[(2-methylpropyl)amino]ethyl}-1-phenyl-1,3,8-triazaspiro[4.5]decan-4-one | spiropiperidine analogue, 47
TypeSmall organic molecule
Emp. Form.C26H34Cl2N4O
Mol. Mass.489.48
SMILESCC(C)CNCCN1CN(c2ccccc2)C2(CCN(Cc3c(Cl)cccc3Cl)CC2)C1=O