Reaction Details
TargetCarbonic anhydrase 13
LigandBDBM26998
Substrate/CompetitorBDBM10856
Meas. Tech.CA Inhibition Assay
Ki 645±n/a nM
Citation Temperini, CCecchi, AScozzafava, ASupuran, CT Carbonic anhydrase inhibitors. Comparison of chlorthalidone, indapamide, trichloromethiazide, and furosemide X-ray crystal structures in adducts with isozyme II, when several water molecules make the difference. Bioorg Med Chem17:1214-21 (2009) 
 
Carbonic anhydrase 13
Name:Carbonic anhydrase 13
Type:Enzyme
Mol. Mass.:29522.80
Organism:Mus musculus (mouse)
Description:Murine cloned isozyme
Residue:262
BDBM26998
BDBM10856
NameBDBM26998
Synonyms:6-chloro-3-(dichloromethyl)-1,1-dioxo-3,4-dihydro-2H-1,2,4-benzothiadiazine-7-sulfonamide trichloromethiazide, 6
TypeSmall organic molecule
Emp. Form.C8H8Cl3N3O4S2
Mol. Mass.380.656
SMILESNS(=O)(=O)c1cc2c(NC(NS2(=O)=O)C(Cl)Cl)cc1Cl