Reaction Details
TargetCarbonic anhydrase 15 [19-324]
LigandBDBM10880
Substrate/CompetitorBDBM10856
Meas. Tech.CA Inhibition Assay
Ki 72±n/a nM
Citation Hilvo, MSalzano, AMInnocenti, AKulomaa, MSScozzafava, AScaloni, AParkkila, SSupuran, CT Cloning, expression, post-translational modifications and inhibition studies on the latest mammalian carbonic anhydrase isoform, CA XV. J Med Chem52:646-54 (2009) 
 
Carbonic anhydrase 15 [19-324]
Name:Carbonic anhydrase 15 [19-324]
Type:Enzyme
Mol. Mass.:33409.51
Organism:Mus musculus (mouse)
Description:Mouse cloned isozyme.
Residue:306
BDBM10880
BDBM10856
NameBDBM10880
Synonyms:AZA AZM acetazolamide Acetazolamide Acetazolamide (AZA) Acetazolamide, 5 Acetazolamide, AZA CHEMBL20 Sulfonamide, 1 US11278534, Example acetazolamide sulfonamide 1
TypeSmall organic molecule
Emp. Form.C4H6N4O3S2
Mol. Mass.222.245
SMILESCC(=O)Nc1nnc(s1)S(N)(=O)=O