Reaction Details
TargetCarbonic anhydrase 6
LigandBDBM10889
Substrate/CompetitorBDBM10856
Meas. Tech.CA Inhibition Assay
Ki 0.8±n/a nM
Citation Hilvo, MSalzano, AMInnocenti, AKulomaa, MSScozzafava, AScaloni, AParkkila, SSupuran, CT Cloning, expression, post-translational modifications and inhibition studies on the latest mammalian carbonic anhydrase isoform, CA XV. J Med Chem52:646-54 (2009) 
 
Carbonic anhydrase 6
Name:Carbonic anhydrase 6
Type:Enzyme
Mol. Mass.:35371.40
Organism:Homo sapiens (Human)
Description:P23280
Residue:308
BDBM10889
BDBM10856
NameBDBM10889
Synonyms:2-methoxy-N-[(1-methylpyrrolidin-2-yl)methyl]-5-sulfamoylbenzamide Sulpiride (SLP)
TypeSmall organic molecule
Emp. Form.C14H21N3O4S
Mol. Mass.327.399
SMILESCOc1ccc(cc1C(=O)NCC1CCCN1C)S(N)(=O)=O