Reaction Details
TargetTyrosine-protein kinase BTK
LigandBDBM263529
Substrate/Competitorn/a
Meas. Tech.TR-FRET (Time Resolved FRET) Assay
pH7.15±n/a
IC50 3.50±0 nM
Commentsextracted
Citation Lopez-Tapia, FJKong, NSo, SLou, YDominique, R Inhibitors of bruton's tyrosine kinase US Patent US9556150 Publication Date 1/31/2017
 
Tyrosine-protein kinase BTK
Name:Tyrosine-protein kinase BTK
Type:Enzyme
Mol. Mass.:76289.95
Organism:Homo sapiens (Human)
Description:Q06187
Residue:659
BDBM263529
NameBDBM263529
Synonyms:(2-{5-amino-1-[4-(3-bromo- phenoxy)-2-methyl-phenyl]-1h- pyrazole-4-carbonyl}-1h-indol- 5-yl)-morpholin-4-yl-methanone | US9556150, i-17
TypeSmall organic molecule
Emp. Form.C30H26BrN5O4
Mol. Mass.600.463
SMILESCc1cc(Oc2cccc(Br)c2)ccc1-n1ncc(C(=O)c2cc3cc(ccc3[nH]2)C(=O)N2CCOCC2)c1N