Reaction Details
TargetTyrosine-protein kinase BTK
LigandBDBM263530
Substrate/Competitorn/a
Meas. Tech.TR-FRET (Time Resolved FRET) Assay
pH7.15±n/a
IC50 5.20±0 nM
Commentsextracted
Citation Lopez-Tapia, FJKong, NSo, SLou, YDominique, R Inhibitors of bruton's tyrosine kinase US Patent US9556150 Publication Date 1/31/2017
 
Tyrosine-protein kinase BTK
Name:Tyrosine-protein kinase BTK
Type:Enzyme
Mol. Mass.:76289.95
Organism:Homo sapiens (Human)
Description:Q06187
Residue:659
BDBM263530
NameBDBM263530
Synonyms:3-(4-{5-amino-4-[5- (morpholine-4-carbonyl)-1h- indole-2-carbonyl]-pyrazol-1- yl}-3-methyl-phenoxy)- benzonitrile | US9556150, i-18
TypeSmall organic molecule
Emp. Form.C31H26N6O4
Mol. Mass.546.5759
SMILESCc1cc(Oc2cccc(c2)C#N)ccc1-n1ncc(C(=O)c2cc3cc(ccc3[nH]2)C(=O)N2CCOCC2)c1N