Reaction Details
TargetTyrosine-protein kinase BTK
LigandBDBM263566
Substrate/Competitorn/a
Meas. Tech.TR-FRET (Time Resolved FRET) Assay
pH7.15±n/a
IC50 2.90±0 nM
Commentsextracted
Citation Lopez-Tapia, FJKong, NSo, SLou, YDominique, R Inhibitors of bruton's tyrosine kinase US Patent US9556150 Publication Date 1/31/2017
 
Tyrosine-protein kinase BTK
Name:Tyrosine-protein kinase BTK
Type:Enzyme
Mol. Mass.:76289.95
Organism:Homo sapiens (Human)
Description:Q06187
Residue:659
BDBM263566
NameBDBM263566
Synonyms:2-{5-amino-1-[2-chloro-4-(2- dimethylcarbamoyl-phenoxy)- phenyl]-1h-pyrazole-carbonyl}- 1h-indole-5-carboxylic acid (1- methyl-pyrrolidin-3-y1)-amide acetic acid salt | US9556150, i-54
TypeSmall organic molecule
Emp. Form.C33H32ClN7O4
Mol. Mass.626.105
SMILESCN(C)C(=O)c1ccccc1Oc1ccc(c(Cl)c1)-n1ncc(C(=O)c2cc3cc(ccc3[nH]2)C(=O)NC2CCN(C)C2)c1N